{"text_format":"1","workbook":"xlsx","n_sheets":4,"sheets":["Tabelle Projektdatenblatt","PV-Förderung","Tabelle Kirchengemeinden","Tabelle Einzelkirchengemeinde"],"not_rendered":{"charts":0,"images":4,"macros":0,"external_links":0,"defined_names":5,"comments":1,"pivot_tables":0},"unopened":[],"bounds":{"document_bytes":16777216,"sheet_cells":100000,"rows_first":2000,"rows_last":500,"rows_between":2000,"halvings":0,"cell_chars":16384,"cell_head_chars":4096},"cells_cut":0,"cells_raw":0,"read":"whole","date_system":"1900"}

{"sheet":"Tabelle Projektdatenblatt","index":0,"n_rows":130,"n_cols":42,"rows_kept":130,"cut":false,"hidden":false,"merged":[[16,18,16,31],[9,1,9,5],[9,6,9,9],[23,5,23,15],[26,18,26,31],[27,18,27,31],[28,18,28,31],[17,1,17,15],[24,18,24,31],[23,18,23,31],[11,1,11,4],[12,1,12,4],[13,5,13,15],[15,1,15,4],[9,18,9,31],[14,18,14,31],[15,18,15,31],[44,18,44,31],[30,18,30,31],[28,1,28,4],[28,5,28,15],[38,12,38,15],[29,5,29,15],[33,18,33,31],[27,5,27,15],[29,18,29,31],[35,18,35,31],[36,18,36,31],[40,18,40,31],[39,18,39,31],[38,18,38,31],[37,18,37,31],[27,1,27,4],[40,7,40,8],[41,1,41,6],[43,1,43,6],[41,9,41,10],[41,7,41,8],[39,12,39,15],[52,18,52,31],[50,18,50,31],[47,18,47,31],[39,9,39,10],[39,7,39,8],[40,1,40,6],[43,7,43,8],[50,1,50,10],[31,18,31,31],[32,18,32,31],[50,12,50,15],[39,1,39,6],[46,1,46,10],[40,12,40,15],[41,12,41,15],[47,1,47,10],[32,6,32,10],[38,1,38,10],[34,1,34,10],[36,1,36,10],[37,1,37,10],[32,1,32,5],[42,18,42,31],[43,18,43,31],[54,1,54,11],[19,5,19,15],[54,18,54,31],[46,18,46,31],[48,18,48,31],[51,18,51,31],[49,18,49,31],[53,18,53,31],[35,1,35,10],[33,1,33,10],[35,12,35,15],[36,12,36,15],[37,12,37,15],[45,1,45,10],[43,9,43,10],[47,12,47,15],[24,1,24,4],[24,5,24,15],[26,1,26,4],[26,5,26,15],[40,9,40,10],[45,12,45,15],[51,12,51,15],[54,12,54,15],[49,1,49,10],[52,1,52,10],[48,1,48,10],[53,1,53,10],[51,1,51,10],[16,1,16,4],[32,12,32,15],[34,12,34,15],[20,1,20,4],[20,5,20,15],[33,12,33,15],[29,1,29,4],[19,1,19,4],[52,12,52,15],[53,12,53,15],[43,12,43,15],[46,12,46,15],[44,12,44,15],[48,12,48,15],[44,1,44,10],[18,5,18,15],[30,1,30,15],[25,5,25,15],[55,10,55,20],[55,24,55,31],[56,24,56,31],[49,12,49,15],[10,1,10,15],[0,1,0,31],[1,1,1,31],[31,1,31,5],[31,6,31,10],[31,12,31,15],[34,18,34,31],[56,1,56,9],[56,10,56,20],[55,21,55,23],[56,21,56,23],[55,1,55,9],[41,18,41,31],[21,1,21,4],[21,5,21,15],[25,1,25,4],[2,1,2,27],[18,1,18,4],[15,5,15,15],[16,5,16,15],[7,18,7,31],[7,1,7,14],[8,1,8,14],[6,18,6,31],[11,18,11,31],[9,11,9,14],[8,18,8,31],[13,1,13,4],[12,5,12,15],[12,18,12,31],[13,18,13,31],[4,1,4,15],[4,18,4,31],[5,1,5,6],[5,7,5,8],[5,9,5,10],[5,11,5,14],[6,1,6,14],[3,1,3,31],[42,1,42,6],[42,7,42,8],[42,9,42,10],[42,12,42,15],[22,18,22,31],[20,18,20,31],[17,18,17,31],[10,18,10,31],[18,18,18,31],[19,18,19,31],[25,18,25,31],[22,1,22,15],[21,18,21,31],[5,18,5,31],[11,5,11,15],[14,1,14,15]]}
[]
[null,"Antrag auf eine aufsichtsrechtliche Genehmigung"]
[null,"einer Baumaßnahme"]
[]
[null,"Antragsart",null,null,null,null,null,null,null,null,null,null,null,null,null,null,null,null,"Erforderliche Unterlagen"]
[null,"Investitionsprogramm",null,null,null,null,null,"Jahr",null,null,null,null,null,null,null,null,null,"X","Maßnahmenbeschreibung (Architekt)"]
[null,"Fonds für kirchengemeindliche Strukturveränderungsprozesse FkS",null,null,null,null,null,null,null,null,null,null,null,null,null,null,null,"X","Projekt- und Kostendatenblatt - Kostenberechnung"]
[null,"FdI (Fonds für dringende Investitionen)",null,null,null,null,null,null,null,null,null,null,null,null,null,null,null,"X","Kirchengemeinderatsbeschluss"]
[null,"Eigenfinanzierung",null,null,null,null,null,null,null,null,null,null,null,null,null,null,null,"X","Erläuterung zur Finanzierung (im Bedarfsfall)"]
[null,"Nachhaltigkeitsfonds",null,null,null,null,"Förderart",null,null,null,null,null,null,null,null,null,null,null,"mittelfristige Investitionsplanung (nur bei FkS)"]
[null,"Angaben zur Kirchengemeinde",null,null,null,null,null,null,null,null,null,null,null,null,null,null,null,null,"aktuelles Rechnungsergebnis mit Bilanz"]
[null,"KG-Kennziffer",null,null,null,null,null,null,null,null,null,null,null,null,null,null,null,null,"Zusage von Zuschüssen Dritter (im Bedarfsfall)"]
[null,"Dekanat",null,null,null,{"$f":"VLOOKUP(F12,'Tabelle Kirchengemeinden'!1:1048576,5,FALSE)","v":{"$error":"#N/A"}},null,null,null,null,null,null,null,null,null,null,null,null,"Auswertungsbogen Bewertung kirchlicher Gebäude (nur bei FKS)",null,null,null,null,null,null,null,null,null,null,null,null,null,null,"KG-Kennziffer","Formel \"Gültigkeit\""]
[null,"Kirchengemeinde",null,null,null,{"$f":"VLOOKUP(F12,'Tabelle Kirchengemeinden'!1:1048576,3,FALSE)","v":{"$error":"#N/A"}},null,null,null,null,null,null,null,null,null,null,null,null,"aktuelle Bauschauprotokolle (nur bei FkS)"]
[null,{"$f":"IF(ISNUMBER(FIND(\"GKG\",F14)),\"Bitte Einzelkgde im Dropdown-Menü auswählen\",\"\")","v":""},null,null,null,null,null,null,null,null,null,null,null,null,null,null,null,null,"Bedarfsorientierter Energieausweis (nur bei Nachhaltigkeitsfonds)",null,null,null,null,null,null,null,null,null,null,null,null,null,null,"bei GKG Einzelkirchengemeinde eintragen"]
[null,"Einzelkgde bei GKG",null,null,null,null,null,null,null,null,null,null,null,null,null,null,null,null,"Energieeffizienz bedingte Mehrkosten (nur bei Nachhaltigkeitsfonds)"]
[null,"Seelsorgeeinheit",null,null,null,{"$f":"VLOOKUP(F12,'Tabelle Kirchengemeinden'!1:1048576,2,FALSE)","v":{"$error":"#N/A"}},null,null,null,null,null,null,null,null,null,null,null,"X","Honorarangebot Architekt (nur bei Kosten über 25.000 €)"]
[null,"Angaben zum Objekt",null,null,null,null,null,null,null,null,null,null,null,null,null,null,null,null,"Weitere Unterlagen"]
[null,"Objekt",null,null,null,null,null,null,null,null,null,null,null,null,null,null,null,null,"Sanierungskonzept"]
[null,"Bezeichnung",null,null,null,null,null,null,null,null,null,null,null,null,null,null,null,null,"Gebäudepass (Datenerhebung Architekt und VZ-Kirchenpflege) "]
[null,"Baujahr",null,null,null,null,null,null,null,null,null,null,null,null,null,null,null,null,"Fotodokumentation"]
[null,"Architekt (Urheber)"]
[null,"Angaben zur Baumaßnahme",null,null,null,null,null,null,null,null,null,null,null,null,null,null,null,null,"Stellungnahmen"]
[null,null,null,null,null,null,null,null,null,null,null,null,null,null,null,null,null,null,"Fachberatung (Kindergarten)"]
[null,"Investitionsart",null,null,null,null,null,null,null,null,null,null,null,null,null,null,null,null,"Arbeitssicherheit"]
[null,"Maßnahme",null,null,null,null,null,null,null,null,null,null,null,null,null,null,null,null,"Schornsteinfeger (Heizung)"]
[null,"Bauabschnitt",null,null,null,null,null,null,null,null,null,null,null,null,null,null,null,null,"Gutachten"]
[null,"Gesamtkosten",null,null,null,{"$f":"SUM(M32:P54)","v":10000},null,null,null,null,null,null,null,null,null,null,null,null,"Tragwerksplaner"]
[null,"Architekt",null,null,null,null,null,null,null,null,null,null,null,null,null,null,null,null,"Restaurator"]
[null,"Fachingenieur",null,null,null,null,null,null,null,null,null,null,null,null,null,null,null,null,"Holzschädlingsbefall"]
[null,"Finanzierungsvorschlag",null,null,null,null,null,null,null,null,null,null,null,null,null,null,null,null,"Bauphysiker"]
[null,"Rücklagenentnahmen",null,null,null,null,null,null,null,null,null,310,10000,null,null,null,null,null,"Glockensachverständiger"]
[null,"Rücklagenentnahmen",null,null,null,null,null,null,null,null,null,310,null,null,null,null,null,null,"Schimmelpilzbefall"]
[null,"Allgemeine Investitionsrücklage",null,null,null,null,null,null,null,null,null,311]
[null,"Allgemeines Kapitalvermögen",null,null,null,null,null,null,null,null,null,315,null,null,null,null,null,null,"Kosten"]
[null,"Schuldaufnahme (Ausgleichstock)",null,null,null,null,null,null,null,null,null,341,null,null,null,null,null,null,"Kostenberechnung mit Massen und Einheitspreisen"]
[null,"Schuldaufnahme (Eigenmittel)",null,null,null,null,null,null,null,null,null,342,null,null,null,null,null,null,"Kostenaufstellung der denkmalbedingten Mehraufwendungen"]
[null,"Schuldaufnahme ohne Steuerbedarf",null,null,null,null,null,null,null,null,null,343,null,null,null,null,null,null,"Berechnungen"]
[null,"Innere Darlehen (A - E - O)",null,null,null,null,null,null,null,null,null,349,null,null,null,null,null,null,"Netto- und Brutto-Grundfläche nach DIN 277"]
[null,"Eigene Investitionsmittel",null,null,null,null,null,"Jahr",null,null,null,350,null,null,null,null,null,null,"Brutto-Rauminhalt nach DIN 277"]
{"$rows_left_out":91}
{"sheet":"PV-Förderung","index":1,"n_rows":94,"n_cols":35,"rows_kept":94,"cut":false,"hidden":false,"merged":[[45,17,56,31],[57,1,57,15],[16,17,16,30],[6,16,59,16],[6,1,6,15],[7,1,7,15],[54,5,54,15],[52,5,52,15],[53,5,53,15],[49,1,50,15],[33,25,33,31],[44,7,44,15],[25,1,25,4],[25,5,25,15],[19,17,19,31],[26,17,26,31],[20,17,20,30],[21,17,21,30],[22,17,22,30],[26,1,26,15],[27,1,27,4],[40,5,40,6],[41,1,41,4],[27,5,27,15],[22,1,22,4],[22,5,22,15],[23,1,23,15],[24,1,24,4],[24,5,24,15],[23,17,23,30],[25,17,25,30],[24,17,24,30],[27,17,27,30],[33,17,33,24],[35,17,43,31],[0,1,0,31],[1,1,1,31],[2,1,2,27],[3,1,3,31],[8,1,8,15],[4,1,5,31],[6,17,6,31],[7,17,7,31],[9,17,9,30],[8,17,8,31],[15,5,15,15],[16,1,16,4],[16,5,16,15],[17,1,18,15],[9,1,9,6],[9,7,9,8],[9,9,9,10],[9,11,9,14],[10,1,10,14],[11,18,11,30],[12,18,12,30],[13,17,13,30],[17,17,17,30],[18,17,18,30],[14,17,14,30],[15,17,15,30],[32,5,32,15],[28,17,28,30],[29,17,29,30],[30,17,30,30],[32,17,32,30],[19,1,19,15],[20,1,20,4],[20,5,20,15],[21,1,21,4],[21,5,21,15],[11,1,11,14],[12,1,12,14],[13,1,13,5],[13,6,13,9],[13,11,13,14],[14,1,14,15],[15,1,15,4],[44,1,44,4],[54,1,54,4],[28,1,28,4],[28,5,28,15],[29,1,29,4],[29,5,29,15],[35,1,35,4],[35,5,35,15],[36,1,36,4],[36,5,36,15],[33,1,33,4],[33,5,33,15],[34,1,34,4],[34,5,34,15],[30,1,30,4],[30,5,30,15],[31,1,31,15],[39,1,39,15],[37,1,37,4],[37,5,37,15],[38,1,38,4],[38,5,38,15],[40,1,40,4],[40,7,40,15],[46,5,46,6],[46,7,46,15],[47,5,47,6],[47,7,47,15],[42,5,42,6],[42,7,42,15],[43,5,43,6],[43,7,43,15],[45,5,45,6],[45,7,45,15],[44,5,44,6],[31,17,31,31],[34,17,34,31],[58,12,58,15],[59,12,59,15],[58,17,58,20],[59,17,59,20],[58,21,58,24],[59,21,59,24],[48,1,48,4],[43,1,43,4],[45,1,45,4],[59,5,59,8],[58,9,58,11],[59,9,59,11],[42,1,42,4],[41,5,41,6],[41,7,41,15],[57,18,57,31],[47,1,47,4],[48,5,48,6],[48,7,48,15],[55,1,56,15],[51,1,51,15],[46,1,46,4]]}
[]
[null,"Antrag auf Förderung einer Photovoltaik-Anlage"]
[null,"im Rahmen der Umsetzung des Klimaschutzkonzeptes"]
[]
[null,"Die Stammdaten werden automatisch aus der Tabelle Projektdatenblatt übernommen. Bei nachträglicher Beantragung der PV-Förderung bei bereits                          genehmigtem Vorhaben oder eingereichtem Anrag auf aufsichtsrechtliche Genehmigung bitte das Tabellenblatt PV-Förderung nachreichen.\nBitte reichen Sie mit dem Antragsformular alle erforderlichen Unterlagen ein (siehe rechte Spalte)."]
[]
[null,"Antrag",null,null,null,null,null,null,null,null,null,null,null,null,null,null,null,"Stellungnahme"]
[null,"Linke Spalte auszufüllen durch Antragsteller",null,null,null,null,null,null,null,null,null,null,null,null,null,null,null,"Rechte Spalte auszufüllen durch Klimaschutzmanagement/BBA"]
[null,"Antragsart",null,null,null,null,null,null,null,null,null,null,null,null,null,null,null,"Erforderlichen Unterlagen"]
[null,"Investitionsprogramm",null,null,null,null,null,"Jahr",null,{"$f":"IF('Tabelle Projektdatenblatt'!J6:K6=\"\",\"\",'Tabelle Projektdatenblatt'!J6:K6)","v":""},null,{"$f":"IF('Tabelle Projektdatenblatt'!L6:O6=\"\",\"\",'Tabelle Projektdatenblatt'!L6:O6)","v":""},null,null,null,{"$f":"IF('Tabelle Projektdatenblatt'!P6=\"\",\"\",'Tabelle Projektdatenblatt'!P6)","v":""},null,"Berechnungen/Planungen zur Photovoltaik-Anlage inklusive"]
[null,"Fonds für kirchengemeindliche Strukturveränderungsprozesse FkS",null,null,null,null,null,null,null,null,null,null,null,null,null,{"$f":"IF('Tabelle Projektdatenblatt'!P7=\"\",\"\",'Tabelle Projektdatenblatt'!P7)","v":""},null,null,"> Wirtschaftlichkeitsberechnung/Amortisationszeit"]
[null,"FdI (Fonds für dringende Investitionen)",null,null,null,null,null,null,null,null,null,null,null,null,null,{"$f":"IF('Tabelle Projektdatenblatt'!P8=\"\",\"\",'Tabelle Projektdatenblatt'!P8)","v":""},null,null,"> Energieeinsparung durch Anlagenbetrieb"]
[null,"Eigenfinanzierung",null,null,null,null,null,null,null,null,null,null,null,null,null,{"$f":"IF('Tabelle Projektdatenblatt'!P9=\"\",\"\",'Tabelle Projektdatenblatt'!P9)","v":""},null,null,"> CO2-Einsparung durch Anlagenbetrieb"]
[null,"Nachhaltigkeitsfonds",null,null,null,null,"Förderart",null,null,null,{"$f":"IF('Tabelle Projektdatenblatt'!K10=\"\",\"\",'Tabelle Projektdatenblatt'!K10)","v":""},{"$f":"IF('Tabelle Projektdatenblatt'!L10:O10=\"\",\"\",'Tabelle Projektdatenblatt'!L10:O10)","v":""},null,null,null,{"$f":"IF('Tabelle Projektdatenblatt'!P10=\"\",\"\",'Tabelle Projektdatenblatt'!P10)","v":""},null,"Planunterlagen PV-Anlage (u.a. Dachansicht)"]
[null,"Angaben zum Antragsteller (Rechtsträger auswählen)",null,null,null,null,null,null,null,null,null,null,null,null,null,null,null,"Angebot PV-Anlage (ggf. Vergleichsangebote)"]
[null,"Rechtsträger",null,null,null,null,null,null,null,null,null,null,null,null,null,null,null,"Rechnung (bei bereits realisierten Projekten)"]
[null,"Antragsnummer",null,null,null,null,null,null,null,null,null,null,null,null,null,null,null,"Nachweis Statikprüfung"]
[null,"Hinweis: Mehrere Anträge pro Rechtsträger bis zur max. Fördersumme von 18.000 € möglich. Bitte ab 2. Antrag verfügbare Restfördersumme beachten! Pro Antrag max. Fördersumme von 9.000 €."]
[]
[null,"Angaben zur Kirchengemeinde",null,null,null,null,null,null,null,null,null,null,null,null,null,null,null,"Unterlagen nach Genehmigung/Umsetzung"]
[null,"KG-Kennziffer",null,null,null,{"$f":"IF('Tabelle Projektdatenblatt'!F12:P12=\"\",\"\",'Tabelle Projektdatenblatt'!F12:P12)","v":""},null,null,null,null,null,null,null,null,null,null,null,"Rechnung PV-Anlage"]
[null,"Dekanat",null,null,null,{"$f":"VLOOKUP(F21,'Tabelle Kirchengemeinden'!1:1048576,5,FALSE)","v":{"$error":"#N/A"}},null,null,null,null,null,null,null,null,null,null,null,"Anmeldung der Anlage beim Energieversorger"]
[null,"Kirchengemeinde",null,null,null,{"$f":"VLOOKUP(F21,'Tabelle Kirchengemeinden'!1:1048576,3,FALSE)","v":{"$error":"#N/A"}},null,null,null,null,null,null,null,null,null,null,null,"Fotodokumentation der installierten PV-Anlage"]
[null,{"$f":"IF(ISNUMBER(FIND(\"GKG\",F23)),\"Bitte Einzelkgde im Dropdown-Menü auswählen\",\"\")","v":""}]
[null,"Einzelkgde bei GKG",null,null,null,{"$f":"IF('Tabelle Projektdatenblatt'!F16:P16=\"\",\"\",'Tabelle Projektdatenblatt'!F16:P16)","v":""},null,null,null,null,null,null,null,null,null,null,null,null,null,null,null,null,null,null,null,null,null,null,null,null,null,null,null,"Dropdown-Menüs"]
[null,"Seelsorgeeinheit",null,null,null,{"$f":"VLOOKUP(F21,'Tabelle Kirchengemeinden'!1:1048576,2,FALSE)","v":{"$error":"#N/A"}},null,null,null,null,null,null,null,null,null,null,null,null,null,null,null,null,null,null,null,null,null,null,null,null,null,null,null,null,"< Rechtsträger"]
[null,"Angaben zum Objekt",null,null,null,null,null,null,null,null,null,null,null,null,null,null,null,"Kriterienerfüllung",null,null,null,null,null,null,null,null,null,null,null,null,null,null,null,"Kirchengemeinde"]
[null,"Objekt",null,null,null,{"$f":"IF('Tabelle Projektdatenblatt'!F19:P19=\"\",\"\",'Tabelle Projektdatenblatt'!F19:P19)","v":""},null,null,null,null,null,null,null,null,null,null,null,"Begleitung durch Bauamts-ArchitektInnen und externe PlanerInnen",null,null,null,null,null,null,null,null,null,null,null,null,null,null,null,"Gesamtkirchengemeinde"]
[null,"Bezeichnung",null,null,null,{"$f":"IF('Tabelle Projektdatenblatt'!F20:P20=\"\",\"\",'Tabelle Projektdatenblatt'!F20:P20)","v":""},null,null,null,null,null,null,null,null,null,null,null,"kein Denkmalschutz",null,null,null,null,null,null,null,null,null,null,null,null,null,null,null,"Dekanat"]
[null,"Baujahr",null,null,null,{"$f":"IF('Tabelle Projektdatenblatt'!F21:P21=\"\",\"\",'Tabelle Projektdatenblatt'!F21:P21)","v":""},null,null,null,null,null,null,null,null,null,null,null,"Vorhaben durch HA 13 genehmigt"]
[null,"Architekt (Urheber)",null,null,null,{"$f":"IF('Tabelle Projektdatenblatt'!F22:P22=\"\",\"\",'Tabelle Projektdatenblatt'!F22:P22)","v":""},null,null,null,null,null,null,null,null,null,null,null,null,null,null,null,null,null,null,null,null,null,null,null,null,null,null,null,null,"< Nr. Anlagen"]
[null,"Angaben zur Baumaßnahme",null,null,null,null,null,null,null,null,null,null,null,null,null,null,null,"Voraussichtliche Zuschusshöhe",null,null,null,null,null,null,null,null,null,null,null,null,null,null,null,1]
[null,null,null,null,null,null,null,null,null,null,null,null,null,null,null,null,null,"alle notwendigen Bedingungen erfüllt",null,null,null,null,null,null,null,null,null,null,null,null,null,null,null,2]
[null,"Investitionsart",null,null,null,{"$f":"IF('Tabelle Projektdatenblatt'!F25:P25=\"\",\"\",'Tabelle Projektdatenblatt'!F25:P25)","v":""},null,null,null,null,null,null,null,null,null,null,null,"voraussichtliche Zuschusshöhe",null,null,null,null,null,null,null,{"$f":"H48*300","v":0},null,null,null,null,null,null,null,3]
[null,"Maßnahme",null,null,null,{"$f":"IF('Tabelle Projektdatenblatt'!F26:P26=\"\",\"\",'Tabelle Projektdatenblatt'!F26:P26)","v":""},null,null,null,null,null,null,null,null,null,null,null,"Anmerkungen (BBA: Architekten + Klimaschutzmanagement)",null,null,null,null,null,null,null,null,null,null,null,null,null,null,null,4]
[null,"Bauabschnitt",null,null,null,{"$f":"IF('Tabelle Projektdatenblatt'!F27:P27=\"\",\"\",'Tabelle Projektdatenblatt'!F27:P27)","v":""}]
[null,"Gesamtkosten",null,null,null,{"$f":"IF('Tabelle Projektdatenblatt'!F28:P28=\"\",\"\",'Tabelle Projektdatenblatt'!F28:P28)","v":10000},null,null,null,null,null,null,null,null,null,null,null,null,null,null,null,null,null,null,null,null,null,null,null,null,null,null,null,null,"< Anlagentyp"]
[null,"Architekt",null,null,null,{"$f":"IF('Tabelle Projektdatenblatt'!F29:P29=\"\",\"\",'Tabelle Projektdatenblatt'!F29:P29)","v":""},null,null,null,null,null,null,null,null,null,null,null,null,null,null,null,null,null,null,null,null,null,null,null,null,null,null,null,"Dachanlage"]
[null,"Fachingenieur",null,null,null,{"$f":"IF('Tabelle Projektdatenblatt'!F30:P30=\"\",\"\",'Tabelle Projektdatenblatt'!F30:P30)","v":""},null,null,null,null,null,null,null,null,null,null,null,null,null,null,null,null,null,null,null,null,null,null,null,null,null,null,null,"Fassadenanlage"]
[null,"Angaben zur geplanten oder 2020 realisierten PV-Anlage"]
{"$rows_left_out":55}
{"sheet":"Tabelle Kirchengemeinden","index":2,"n_rows":846,"n_cols":5,"rows_kept":846,"cut":false,"hidden":true,"merged":[[0,0,0,4]]}
["Liste der Kirchengemeinden in der Diözese Rottenburg-Stuttgart"]
[]
["KZ","SE","Kirchengemeinde","Patrozinium","Dekanat"]
[3927,"SE 15 An der Argen","Achberg St. Michael und St. Georg",null,"Allgäu-Oberschwaben"]
[1501,"SE 21 Aitrachtal","Aichstetten, St. Michael",null,"Allgäu-Oberschwaben"]
[1502,"SE 21 Aitrachtal","Aitrach, St. Gordianus und Epimachus",null,"Allgäu-Oberschwaben"]
[1503,"SE 21 Aitrachtal","Altmannshofen, St. Vitus",null,"Allgäu-Oberschwaben"]
[3801,"SE 11 Oberes Achtal","Alttann, St. Nikolaus",null,"Allgäu-Oberschwaben"]
[3901,"SE 15 An der Argen","Amtzell, St. Johannes und Mauritius",null,"Allgäu-Oberschwaben"]
[3824,"SE 12 Bad Wurzach","Arnach, St. Ulrich",null,"Allgäu-Oberschwaben"]
[3802,"SE  9 Aulendorf","Aulendorf, St. Martinus",null,"Allgäu-Oberschwaben"]
[3803,"SE 10 Bad Waldsee","Bad Waldsee, St. Petrus",null,"Allgäu-Oberschwaben"]
[3804,"SE 12 Bad Wurzach","Bad Wurzach, St. Verena",null,"Allgäu-Oberschwaben"]
[2301,"SE  7 Baienfurt-Baindt","Baienfurt, Mariä Himmelfahrt",null,"Allgäu-Oberschwaben"]
[2302,"SE  7 Baienfurt-Baindt","Baindt, St. Johannes Baptist",null,"Allgäu-Oberschwaben"]
[2304,"SE  6 Westliches Schussental","Berg, St. Petrus und Paulus",null,"Allgäu-Oberschwaben"]
[3805,"SE 11 Oberes Achtal","Bergatreute, St. Philippus und Jakobus",null,"Allgäu-Oberschwaben"]
[1505,"SE 17 Isny","Beuren, St. Petrus und Paulus",null,"Allgäu-Oberschwaben"]
[2305,"SE  6 Westliches Schussental","Blitzenreute, St. Laurentius",null,"Allgäu-Oberschwaben"]
[2306,"SE  8a Vorallgäu","Bodnegg, St. Ulrich und Magnus",null,"Allgäu-Oberschwaben"]
[1506,"SE 17 Isny","Bolsternang, St. Martinus",null,"Allgäu-Oberschwaben"]
[3902,"SE 16 Argenbühl","Christazhofen, St. Mauritius",null,"Allgäu-Oberschwaben"]
[2307,"SE  5 Zocklerland","Danketsweiler, St. Johannes Baptist",null,"Allgäu-Oberschwaben"]
[3903,"SE 14 Wangen","Deuchelried, St. Petrus",null,"Allgäu-Oberschwaben"]
[1507,"SE 18 St.Gallus - Allgäu","Diepoldshofen, St. Johann Baptist",null,"Allgäu-Oberschwaben"]
[3806,"SE 12 Bad Wurzach","Dietmanns, St. Ulrich und Margareta",null,"Allgäu-Oberschwaben"]
[3807,"SE 12 Bad Wurzach","Eggmannsried, St. Jakobus",null,"Allgäu-Oberschwaben"]
[3904,"SE 16 Argenbühl","Eglofs, St. Martinus",null,"Allgäu-Oberschwaben"]
[3808,"SE 12 Bad Wurzach","Eintürnenberg, St. Martinus",null,"Allgäu-Oberschwaben"]
[3905,"SE 16 Argenbühl","Eisenharz, St. Benedikt",null,"Allgäu-Oberschwaben"]
[1508,"SE 18 St.Gallus - Allgäu","Engerazhofen, St. Johann Baptist",null,"Allgäu-Oberschwaben"]
[3924,"SE 16 Argenbühl","Enkenhofen, St. Laurentius",null,"Allgäu-Oberschwaben"]
[2309,"SE  5 Zocklerland","Esenhausen, St. Martinus",null,"Allgäu-Oberschwaben"]
[1510,"SE 19 Alpenblick","Friesenhofen, St. Petrus und Paulus",null,"Allgäu-Oberschwaben"]
[2310,"SE  6 Westliches Schussental","Fronhofen, St. Konrad",null,"Allgäu-Oberschwaben"]
[1511,"SE 18 St.Gallus - Allgäu","Gebrazhofen, Mariä Himmelfahrt",null,"Allgäu-Oberschwaben"]
[2312,"SE  8a Vorallgäu","Grünkraut, St. Gallus und Nikolaus",null,"Allgäu-Oberschwaben"]
[3809,"SE 12 Bad Wurzach","Haidgau, St. Nikolaus",null,"Allgäu-Oberschwaben"]
[3810,"SE 10 Bad Waldsee","Haisterkirch, St. Johannes Baptist",null,"Allgäu-Oberschwaben"]
[2341,"SE  8b Tor zum Allgäu","Hannober, FilialKG St. Cassian",null,"Allgäu-Oberschwaben"]
{"$rows_left_out":807}
{"sheet":"Tabelle Einzelkirchengemeinde","index":3,"n_rows":304,"n_cols":4,"rows_kept":304,"cut":false,"hidden":true,"merged":[]}
["Gesamtkirchengemeinden in der Diözese Rottenburg-Stuttgart"]
[]
[]
["Dekanat","GKG","Kennziffer","zugehörige Einzelkirchengemeinden"]
[]
[]
["Allgäu-Oberschwaben","Isny",1518,"GKG"]
[null,null,1518,"Isny, St. Georg und Jakobus"]
[null,null,1518,"Isny, St. Maria"]
[null,null,1518,"Neutrauchburg, ExpV, Zum Kostbaren Blut"]
[]
["Allgäu-Oberschwaben","Ravensburg",2323,"GKG"]
[null,null,2323,"Ravensburg, Christus König"]
[null," ",2323,"Ravensburg, Liebfrauen"]
[null,null,2323,"Ravensburg, St. Christina"]
[null,null,2323,"Ravensburg, St. Jodok"]
[null,null,2323,"Ravensburg, Zur Heiligsten Dreifaltigkeit"]
[null," ",2323,"Bavendorf, St. Columban"]
[null,null,2323,"Eggartskirch, St. Isidor"]
[null,null,2323,"Gornhofen, St. Walburga"]
[null,null,2323,"Obereschach, St. Johann Baptist"]
[null,null,2323,"Oberzell, St. Antonius von Padua"]
[null,null,2323,"Schmalegg, St. Nikolaus"]
[null,null,2323,"Taldorf, St. Petrus"]
[null,null,2323,"Weißenau, St. Petrus und Paulus"]
[]
["Allgäu-Oberschwaben","Wangen",3920,"GKG"]
[null,null,3920,"Wangen, St. Martinus"]
[null,null,3920,"Wangen, St. Ulrich"]
[]
["Allgäu-Oberschwaben","Weingarten",2332,"GKG"]
[null,null,2332,"Weingarten, Heilig Geist"]
[null,null,2332,"Weingarten, St. Maria, Hilfe der Christen"]
[null,null,2332,"Weingarten, St. Martinus (Basilika minor)"]
[]
["Balingen","Tailfingen",218,"GKG"]
[null,null,218,"Tailfingen, St. Elisabeth"]
[null,null,218,"Tailfingen, St. Franziskus"]
[]
["Biberach","Biberach",308,"GKG"]
{"$rows_left_out":264}